{"text_format":"1","workbook":"xlsx","n_sheets":14,"sheets":["1-INFORMACION GENERAL","INFO PROYECTO","2-ENTRADAS","3-PROCESOS","4-SALIDAS","5-RESIDUOS","6-TRANSPORTED","INFO MATERIALES BASE","INFO MATERIALES","INFO D","PROYECTO CASA","DINAMXACTIV (ACTUALIZAR","DINAMICA PROCESO (ACTUALIZAR)","DASHBOARD"],"not_rendered":{"charts":22,"images":0,"macros":0,"external_links":0,"defined_names":185,"comments":0,"pivot_tables":16},"unopened":[],"bounds":{"document_bytes":16777216,"sheet_cells":100000,"rows_first":2000,"rows_last":500,"rows_between":2000,"halvings":0,"cell_chars":16384,"cell_head_chars":4096},"cells_cut":0,"cells_raw":0,"read":"whole","date_system":"1900"}

{"sheet":"1-INFORMACION GENERAL","index":0,"n_rows":25,"n_cols":3,"rows_kept":25,"cut":false,"hidden":false,"merged":[[21,1,24,2],[0,0,0,2],[20,1,20,2],[9,0,9,2],[5,0,5,2],[4,1,4,2]]}
["EVALUACIÓN AMBIENTAL PARA EDIFICACIONES"]
[]
[]
["INFORMACIÓN GENERAL "]
["Nombre del proyecto"]
["VIVIENDA UNIFAMILIAR "]
[]
[]
["Dirección"]
["AV 2 # 29-13 LA RINCONADA. CUCUTA-COLOMBIA"]
[]
["Localización"]
["Pais","Departamento /Provincia"]
["COLOMBIA","Norte de Santander"]
[]
{"$rows_left_out":11}
{"sheet":"INFO PROYECTO","index":1,"n_rows":94,"n_cols":15,"rows_kept":94,"cut":false,"hidden":false,"merged":[]}
["PAISES","ARGENTINA","BRASIL","CHILE","COLOMBIA","ESPAÑA","MEXICO "]
["ARGENTINA","Ciudad de buenos aires","Acre","Arica y parinacota","Amazonas"," A Coruña ","Ciudad de mexico"]
["BRASIL","corrientes","Alargoas","Tarapacá","Antioquía","Álava","Aguas calientes"]
["CHILE","Mendoza","Amapá","Antofagasta","Arauca","Albacete","Baja california"]
["COLOMBIA","San luis","Amazonas","Atacama","Atlántico","Alicante","Baja california sur"]
["ESPAÑA","Buenos aires","Bahia","Atacama","Bolívar","Almería","Campeche"]
["MEXICO ","entre rios","Ceará","Coquimbo","Boyacá","Asturias","Chiapas"]
[null,"Misiones","Espirito santo","Valparaíso","Caldas","Ávila","Chiguagua"]
[null,"Santa cruz","Goiás","Metropolitana"," Caquetá","Badajoz","Coahuila de Zaragoza"]
[null,"Catamarca ","Maranhao","O higgins","Casanare","Baleares","Colima"]
[null,"formosa","Mato grosso","Maule ","Cauca","Barcelona","Durango"]
[null,"Neuquen","Mato grosso do sul","Bio-Bio","Cesar","Burgos","Guanajuato "]
[null,"Santa  fe","Minas Gerais","La araucanía","Chocó","Cáceres","Guerrero"]
[null,"Chaco ","Pará","Los Rios","Córdoba","Cádiz","Hidalgo "]
[null,"Jujuy","Paraiba","Los Lagos","Cundinamarca","Cantabria","Jalisco"]
{"$rows_left_out":80}
{"sheet":"2-ENTRADAS","index":2,"n_rows":54,"n_cols":7,"rows_kept":54,"cut":false,"hidden":false,"merged":[[53,4,54,6],[53,3,54,3]]}
["ACTIVIDAD","SUBACTIVIDAD","TIPO ","MATERIAL","INDICADOR (milipunto/Kilogramo)","KG","milipuntos"]
["PRELIMINARES","Replanteo","CONSTRUCCIÓN","cal (hidratada)",{"$f":"VLOOKUP(D2,'INFO MATERIALES BASE'!$A$2:$E$92,2,)","v":21},10,{"$f":"(F2*E2)","v":210}]
["PRELIMINARES","Replanteo","CONSTRUCCIÓN","Gravilla ",{"$f":"VLOOKUP(D3,'INFO MATERIALES BASE'!$A$2:$E$92,2,)","v":0.84},50,42]
["PRELIMINARES","Replanteo","CONSTRUCCIÓN","Arena ",{"$f":"VLOOKUP(D4,'INFO MATERIALES BASE'!$A$2:$E$92,2,)","v":0.82},50,41]
["PRELIMINARES","Replanteo","CONSTRUCCIÓN","Tableros de madera",{"$f":"VLOOKUP(D5,'INFO MATERIALES BASE'!$A$2:$E$92,2,)","v":39},10,390]
["CIMENTACIÓN ","Zapata aislada","METALES_FÉRRICOS","Acero ",{"$f":"VLOOKUP(D6,'INFO MATERIALES BASE'!$A$2:$E$92,2,)","v":86},90,7740]
["CIMENTACIÓN ","Zapata aislada","EMBALAJE ","Papel ",{"$f":"VLOOKUP(D7,'INFO MATERIALES BASE'!$A$2:$E$92,2,)","v":96},10,960]
["CIMENTACIÓN ","Zapata aislada","CONSTRUCCIÓN","Hormigón sin refuerzo",{"$f":"VLOOKUP(D8,'INFO MATERIALES BASE'!$A$2:$E$92,2,)","v":3.8},1225,4655]
["CIMENTACIÓN ","Zapata aislada","CONSTRUCCIÓN","Tableros de madera",{"$f":"VLOOKUP(D9,'INFO MATERIALES BASE'!$A$2:$E$92,2,)","v":39},30,1170]
["ESTRUCTURA","Columna ","METALES_FÉRRICOS","Acero ",{"$f":"VLOOKUP(D10,'INFO MATERIALES BASE'!$A$2:$E$92,2,)","v":86},200,17200]
["ESTRUCTURA","Columna ","CAUCHO","GomasEPDM",{"$f":"VLOOKUP(D11,'INFO MATERIALES BASE'!$A$2:$E$92,2,)","v":360},2,720]
["ESTRUCTURA","Columna ","CONSTRUCCIÓN","Hormigón sin refuerzo",{"$f":"VLOOKUP(D12,'INFO MATERIALES BASE'!$A$2:$E$92,2,)","v":3.8},3520,13376]
["ESTRUCTURA","Vigas","METALES_FÉRRICOS","Acero ",{"$f":"VLOOKUP(D13,'INFO MATERIALES BASE'!$A$2:$E$92,2,)","v":86},330,28380]
["ESTRUCTURA","Vigas","CONSTRUCCIÓN","Hormigón sin refuerzo",{"$f":"VLOOKUP(D14,'INFO MATERIALES BASE'!$A$2:$E$92,2,)","v":3.8},4200,{"$f":"(F14*E14)","v":15960}]
["ESTRUCTURA","Placa aligerada","CONSTRUCCIÓN","Hormigón sin refuerzo",{"$f":"VLOOKUP(D15,'INFO MATERIALES BASE'!$A$2:$E$92,2,)","v":3.8},5000,{"$f":"(F15*E15)","v":19000}]
{"$rows_left_out":40}
{"sheet":"3-PROCESOS","index":3,"n_rows":24,"n_cols":7,"rows_kept":24,"cut":false,"hidden":false,"merged":[[23,3,24,3],[23,4,24,6]]}
["ACTIVIDAD","SUBACTIVIDAD","TIPO ","MATERIAL ","INDICADOR (milipunto/Kilogramo)","KG/m3","milipuntos"]
["PRELIMINARES","Replanteo","CONSTRUCCIÓN","Uso del suelo",{"$f":"VLOOKUP(D2,'INFO MATERIALES BASE'!$A$2:$E$92,2,)","v":45},8,{"$f":"(F2*E2)","v":360}]
["CIMENTACIÓN ","Zapata aislada","CONSTRUCCIÓN","Construcción solida",{"$f":"VLOOKUP(D3,'INFO MATERIALES BASE'!$A$2:$E$92,2,)","v":1500},4,{"$f":"(F3*E3)","v":6000}]
["ESTRUCTURA","Columna ","CONSTRUCCIÓN","Construcción solida",{"$f":"VLOOKUP(D4,'INFO MATERIALES BASE'!$A$2:$E$92,2,)","v":1500},12,18000]
["ESTRUCTURA","Vigas","CONSTRUCCIÓN","Construcción solida",{"$f":"VLOOKUP(D5,'INFO MATERIALES BASE'!$A$2:$E$92,2,)","v":1500},14,21000]
["ESTRUCTURA","Placa aligerada","CONSTRUCCIÓN","Construcción solida",{"$f":"VLOOKUP(D6,'INFO MATERIALES BASE'!$A$2:$E$92,2,)","v":1500},30,{"$f":"(F6*E6)","v":45000}]
["MUROS","Mampostería bloque","PLÁSTICO","PUR bloques espuma flexible",{"$f":"VLOOKUP(D7,'INFO MATERIALES BASE'!$A$2:$E$92,2,)","v":480},3,{"$f":"(F7*E7)","v":1440}]
["INSTALACIONES","Instalaciones eléctricas","PLÁSTICO","PET",{"$f":"VLOOKUP(D8,'INFO MATERIALES BASE'!$A$2:$E$92,2,)","v":380},2,{"$f":"(F8*E8)","v":760}]
["INSTALACIONES","Instalaciones eléctricas","PLÁSTICO","LDPE",{"$f":"VLOOKUP(D9,'INFO MATERIALES BASE'!$A$2:$E$92,2,)","v":360},2,720]
["INSTALACIONES","Instalaciones sanitarias","PLÁSTICO","LDPE",{"$f":"VLOOKUP(D10,'INFO MATERIALES BASE'!$A$2:$E$92,2,)","v":360},2,720]
["INSTALACIONES","Instalaciones hidráulicas ","PLÁSTICO","LDPE",{"$f":"VLOOKUP(D11,'INFO MATERIALES BASE'!$A$2:$E$92,2,)","v":360},2,720]
["ACABADO","Pañete ","CONSTRUCCIÓN","Hormigón sin refuerzo",{"$f":"VLOOKUP(D12,'INFO MATERIALES BASE'!$A$2:$E$92,2,)","v":3.8},10,38]
["ACABADO","Estuco","CONSTRUCCIÓN","Hiero fundido ",{"$f":"VLOOKUP(D13,'INFO MATERIALES BASE'!$A$2:$E$92,2,)","v":240},10,2400]
["ACABADO","Divisiones en vidrio","CONSTRUCCIÓN","Construcción en metal",{"$f":"VLOOKUP(D14,'INFO MATERIALES BASE'!$A$2:$E$92,2,)","v":4300},1,4300]
["ACABADO","barandas","CONSTRUCCIÓN","Barniz alquídico ",{"$f":"VLOOKUP(D15,'INFO MATERIALES BASE'!$A$2:$E$92,2,)","v":520},66,34320]
{"$rows_left_out":10}
{"sheet":"4-SALIDAS","index":4,"n_rows":20,"n_cols":8,"rows_kept":20,"cut":false,"hidden":false,"merged":[[19,3,20,3],[19,4,20,7]]}
["ACTIVIDAD","SUB-ACTIVIDAD","TIPO ","MATERIAL ","INDICADOR (milipunto/Kilogramo)","FACTOR % DESPERDICIO","KG","milipuntos"]
["PRELIMINARES","Replanteo","CONSTRUCCIÓN","Uso del suelo",{"$f":"VLOOKUP(D2,'INFO MATERIALES BASE'!$A$2:$E$92,2,)","v":45},0.1,{"$f":"+Tabla832[[#This Row],[KG/m3]]","v":8},{"$f":"(F2*E2*Tabla840[[#This Row],[KG]])","v":36}]
["PRELIMINARES","Replanteo","CONSTRUCCIÓN","Construcción solida",{"$f":"VLOOKUP(D3,'INFO MATERIALES BASE'!$A$2:$E$92,2,)","v":1500},0.15,{"$f":"+G2","v":8},{"$f":"(F3*E3*Tabla840[[#This Row],[KG]])","v":1800}]
["CIMENTACIÓN ","Zapata aislada","CONSTRUCCIÓN","Construcción en metal",{"$f":"VLOOKUP(D4,'INFO MATERIALES BASE'!$A$2:$E$92,2,)","v":4300},0.15,{"$f":"+'3-PROCESOS'!F3","v":4},{"$f":"(F4*E4*Tabla840[[#This Row],[KG]])","v":2580}]
["ESTRUCTURA","Columna ","CONSTRUCCIÓN","Construcción solida",{"$f":"VLOOKUP(D5,'INFO MATERIALES BASE'!$A$2:$E$92,2,)","v":1500},0.15,{"$f":"+'3-PROCESOS'!F4","v":12},{"$f":"(F5*E5*Tabla840[[#This Row],[KG]])","v":2700}]
["ESTRUCTURA","Vigas","CONSTRUCCIÓN","Construcción solida",{"$f":"VLOOKUP(D6,'INFO MATERIALES BASE'!$A$2:$E$92,2,)","v":1500},0.15,{"$f":"+'3-PROCESOS'!F5","v":14},{"$f":"(F6*E6*Tabla840[[#This Row],[KG]])","v":3150}]
["ESTRUCTURA","Placa aligerada","CONSTRUCCIÓN","Construcción solida",{"$f":"VLOOKUP(D7,'INFO MATERIALES BASE'!$A$2:$E$92,2,)","v":1500},0.15,{"$f":"+'3-PROCESOS'!F6","v":30},{"$f":"(F7*E7*Tabla840[[#This Row],[KG]])","v":6750}]
["MUROS","Mampostería bloque","CONSTRUCCIÓN","Construcción solida",{"$f":"VLOOKUP(D8,'INFO MATERIALES BASE'!$A$2:$E$92,2,)","v":1500},0.1,{"$f":"+'3-PROCESOS'!F7","v":3},{"$f":"(F8*E8*Tabla840[[#This Row],[KG]])","v":450}]
["INSTALACIONES","Instalaciones eléctricas","CONSTRUCCIÓN","Construcción solida",{"$f":"VLOOKUP(D9,'INFO MATERIALES BASE'!$A$2:$E$92,2,)","v":1500},0.1,{"$f":"+Tabla832[[#This Row],[KG/m3]]","v":2},{"$f":"(F9*E9*Tabla840[[#This Row],[KG]])","v":300}]
["INSTALACIONES","Instalaciones sanitarias","CONSTRUCCIÓN","Construcción solida",{"$f":"VLOOKUP(D10,'INFO MATERIALES BASE'!$A$2:$E$92,2,)","v":1500},0.1,{"$f":"+Tabla832[[#This Row],[KG/m3]]","v":2},{"$f":"(F10*E10*Tabla840[[#This Row],[KG]])","v":300}]
["INSTALACIONES","Instalaciones sanitarias","CONSTRUCCIÓN","Construcción solida",{"$f":"VLOOKUP(D11,'INFO MATERIALES BASE'!$A$2:$E$92,2,)","v":1500},0.1,{"$f":"+Tabla832[[#This Row],[KG/m3]]","v":2},{"$f":"(F11*E11*Tabla840[[#This Row],[KG]])","v":300}]
["ACABADO","Pañete ","CONSTRUCCIÓN","Construcción solida",{"$f":"VLOOKUP(D12,'INFO MATERIALES BASE'!$A$2:$E$92,2,)","v":1500},0.14000000000000001,10,{"$f":"(F12*E12*Tabla840[[#This Row],[KG]])","v":2100.0000000000005}]
["ACABADO","Pintura vinilo ","CONSTRUCCIÓN","Yeso ",{"$f":"VLOOKUP(D13,'INFO MATERIALES BASE'!$A$2:$E$92,2,)","v":9.9},0.14000000000000001,{"$f":"+'2-ENTRADAS'!F48","v":66},{"$f":"(F13*E13*Tabla840[[#This Row],[KG]])","v":91.476000000000013}]
["ACABADO","envolvente especial","CONSTRUCCIÓN","Construcción en metal",{"$f":"VLOOKUP(D14,'INFO MATERIALES BASE'!$A$2:$E$92,2,)","v":4300},0.14000000000000001,15,{"$f":"(F14*E14*Tabla840[[#This Row],[KG]])","v":9030.0000000000018}]
[]
{"$rows_left_out":6}
{"sheet":"5-RESIDUOS","index":5,"n_rows":25,"n_cols":7,"rows_kept":25,"cut":false,"hidden":false,"merged":[[24,3,25,3],[24,4,25,6]]}
["ACTIVIDAD","SUBACTIVIDAD","TIPO ","MATERIAL ","INDICADOR (milipunto/Kilogramo)","kg","milipuntos"]
["PRELIMINARES","Replanteo","RECICLADO","reciclado de PAPEL ",{"$f":"VLOOKUP(D2,'INFO MATERIALES BASE'!$A$2:$E$92,2,)","v":-1.2},{"$f":"(Tabla832[[#This Row],[KG/m3]]*0.1)","v":0.8},{"$f":"(F2*E2)","v":-0.96}]
["CIMENTACIÓN ","Zapata aislada","RECICLADO","Reciclado de metales de hierro",{"$f":"VLOOKUP(D3,'INFO MATERIALES BASE'!$A$2:$E$92,2,)","v":-70},{"$f":"('4-SALIDAS'!G4*'4-SALIDAS'!F4)","v":0.6},{"$f":"(F3*E3)","v":-42}]
["ESTRUCTURA","Columna ","RECICLADO","Reciclado de metales de hierro",{"$f":"VLOOKUP(D4,'INFO MATERIALES BASE'!$A$2:$E$92,2,)","v":-70},{"$f":"('4-SALIDAS'!G5*'4-SALIDAS'!F5)","v":1.7999999999999998},-125.99999999999999]
["ESTRUCTURA","Vigas","RECICLADO","Reciclado de metales de hierro",{"$f":"VLOOKUP(D5,'INFO MATERIALES BASE'!$A$2:$E$92,2,)","v":-70},{"$f":"('4-SALIDAS'!G6*'4-SALIDAS'!F6)","v":2.1},-147]
["ESTRUCTURA","Placa aligerada","RECICLADO","Reciclado de metales de hierro",{"$f":"VLOOKUP(D6,'INFO MATERIALES BASE'!$A$2:$E$92,2,)","v":-70},{"$f":"('4-SALIDAS'!G7*'4-SALIDAS'!F7)","v":4.5},{"$f":"(F6*E6)","v":-315}]
["MUROS","Mampostería bloque","RECICLADO","Incineracioncarton ",{"$f":"VLOOKUP(D7,'INFO MATERIALES BASE'!$A$2:$E$92,2,)","v":-12},{"$f":"('4-SALIDAS'!G8*'4-SALIDAS'!F8)","v":0.30000000000000004},{"$f":"(F7*E7)","v":-3.6000000000000005}]
["INSTALACIONES","Instalaciones eléctricas","RECICLADO","Reciclado de PVC",{"$f":"VLOOKUP(D8,'INFO MATERIALES BASE'!$A$2:$E$92,2,)","v":-170},{"$f":"('4-SALIDAS'!G9*'4-SALIDAS'!F9)","v":0.2},{"$f":"(F8*E8)","v":-34}]
["INSTALACIONES","Instalaciones sanitarias","RECICLADO","Reciclado de PVC",{"$f":"VLOOKUP(D9,'INFO MATERIALES BASE'!$A$2:$E$92,2,)","v":-170},0.2,-34]
["INSTALACIONES","Instalaciones hidráulicas ","RECICLADO","Reciclado de PVC",{"$f":"VLOOKUP(D10,'INFO MATERIALES BASE'!$A$2:$E$92,2,)","v":-170},0.2,-34]
["ACABADO","Pañete ","RECICLADO","Reciclado de Pe",{"$f":"VLOOKUP(D11,'INFO MATERIALES BASE'!$A$2:$E$92,2,)","v":-240},{"$f":"('4-SALIDAS'!G14*'4-SALIDAS'!F14)","v":2.1},-504]
["ACABADO","Estuco","RECICLADO","Reciclado de Pe",{"$f":"VLOOKUP(D12,'INFO MATERIALES BASE'!$A$2:$E$92,2,)","v":-240},1.4,-336]
["ACABADO","Divisiones en vidrio","RECICLADO","Reciclado de vidrio ",{"$f":"VLOOKUP(D13,'INFO MATERIALES BASE'!$A$2:$E$92,2,)","v":-15},0.01,-0.15]
["ACABADO","barandas","RECICLADO","Reciclado de aluminio ",{"$f":"VLOOKUP(D14,'INFO MATERIALES BASE'!$A$2:$E$92,2,)","v":-720},{"$f":"(10*10%)","v":1},-720]
["ACABADO","Ventanas aluminio","RECICLADO","Reciclado de aluminio ",{"$f":"VLOOKUP(D15,'INFO MATERIALES BASE'!$A$2:$E$92,2,)","v":-720},5,-3600]
{"$rows_left_out":11}
{"sheet":"6-TRANSPORTED","index":6,"n_rows":18,"n_cols":8,"rows_kept":18,"cut":false,"hidden":false,"merged":[[17,3,18,3],[17,4,18,7]]}
["ACTIVIDAD","SUBACTIVIDAD","TIPO ","MATERIAL ","INDICADOR (milipunto/Kilogramo)","kg","FACTOR % DESPERDICIO","milipuntos"]
["CIMENTACIÓN ","Zapata aislada","TRANSPORTE ","Camión 16 t ",{"$f":"VLOOKUP(D2,'INFO MATERIALES BASE'!$A$2:$E$92,2,)","v":34},{"$f":"+'4-SALIDAS'!G4","v":4},0.15,{"$f":"(G2*E2*Tabla8404142[[#This Row],[kg]])","v":20.399999999999999}]
["ESTRUCTURA","Columna ","TRANSPORTE ","Camión 16 t ",{"$f":"VLOOKUP(D3,'INFO MATERIALES BASE'!$A$2:$E$92,2,)","v":34},{"$f":"+'4-SALIDAS'!G5","v":12},0.15,{"$f":"(G3*E3*Tabla8404142[[#This Row],[kg]])","v":61.199999999999996}]
["ESTRUCTURA","Vigas","TRANSPORTE ","Camión 40 t ",{"$f":"VLOOKUP(D4,'INFO MATERIALES BASE'!$A$2:$E$92,2,)","v":15},{"$f":"+'4-SALIDAS'!G6","v":14},0.15,{"$f":"(G4*E4*Tabla8404142[[#This Row],[kg]])","v":31.5}]
["ESTRUCTURA","Placa aligerada","TRANSPORTE ","Camión 28 t ",{"$f":"VLOOKUP(D5,'INFO MATERIALES BASE'!$A$2:$E$92,2,)","v":22},{"$f":"+'4-SALIDAS'!G7","v":30},0.15,{"$f":"(G5*E5*Tabla8404142[[#This Row],[kg]])","v":99}]
["MUROS","Mampostería bloque","TRANSPORTE ","Camión 16 t ",{"$f":"VLOOKUP(D6,'INFO MATERIALES BASE'!$A$2:$E$92,2,)","v":34},{"$f":"+'4-SALIDAS'!G8","v":3},0.15,{"$f":"(G6*E6*Tabla8404142[[#This Row],[kg]])","v":15.299999999999999}]
["INSTALACIONES","Instalaciones eléctricas","TRANSPORTE ","Camión 16 t ",{"$f":"VLOOKUP(D7,'INFO MATERIALES BASE'!$A$2:$E$92,2,)","v":34},{"$f":"+'4-SALIDAS'!G9","v":2},0.15,{"$f":"(G7*E7*Tabla8404142[[#This Row],[kg]])","v":10.199999999999999}]
["INSTALACIONES","Instalaciones sanitarias","TRANSPORTE ","Camión 16 t ",{"$f":"VLOOKUP(D8,'INFO MATERIALES BASE'!$A$2:$E$92,2,)","v":34},{"$f":"+'4-SALIDAS'!G10","v":2},0.15,{"$f":"(G8*E8*Tabla8404142[[#This Row],[kg]])","v":10.199999999999999}]
["INSTALACIONES","Instalaciones hidráulicas ","TRANSPORTE ","Camión 16 t ",{"$f":"VLOOKUP(D9,'INFO MATERIALES BASE'!$A$2:$E$92,2,)","v":34},{"$f":"+'4-SALIDAS'!G11","v":2},0.15,{"$f":"(G9*E9*Tabla8404142[[#This Row],[kg]])","v":10.199999999999999}]
["ACABADO","Pañete ","TRANSPORTE ","Camión 16 t ",{"$f":"VLOOKUP(D10,'INFO MATERIALES BASE'!$A$2:$E$92,2,)","v":34},{"$f":"+'4-SALIDAS'!G14","v":15},0.15,{"$f":"(G10*E10*Tabla8404142[[#This Row],[kg]])","v":76.5}]
["ACABADO","envolvente especial","TRANSPORTE ","Camión 28 t ",{"$f":"VLOOKUP(D11,'INFO MATERIALES BASE'!$A$2:$E$92,2,)","v":22},{"$f":"+Tabla840[[#This Row],[KG]]","v":2},0.15,{"$f":"(G11*E11*Tabla8404142[[#This Row],[kg]])","v":6.6}]
["ACABADO","Pintura vinilo ","TRANSPORTE ","Camión 28 t ",{"$f":"VLOOKUP(D12,'INFO MATERIALES BASE'!$A$2:$E$92,2,)","v":22},{"$f":"+'4-SALIDAS'!G13","v":66},0.15,{"$f":"(G12*E12*Tabla8404142[[#This Row],[kg]])","v":217.79999999999998}]
[]
[]
[null,null,null,null,null,null,"TOTAL",{"$f":"SUM(H2:H14)","v":558.9}]
{"$rows_left_out":4}
{"sheet":"INFO MATERIALES BASE","index":7,"n_rows":92,"n_cols":5,"rows_kept":92,"cut":false,"hidden":false,"merged":[]}
["Material","Indicador ","Descripción","cód","grupo"]
["Hiero fundido ",240,"Hierro fundido con >2% de carbón","F1","METALES_FÉRRICOS"]
["Acero de convertidores",94,"Bloque de material con acero primario","F2","METALES_FÉRRICOS"]
["Acero de arco eléctrico",24,"Bloque de material con chatarra","F3","METALES_FÉRRICOS"]
["Acero ",86,"Bloque de material 80% primario 20% chatarra","F4","METALES_FÉRRICOS"]
["Acero alta aleación ",910,"Bloque de material con 71% acero primario y otros componentes","F5","METALES_FÉRRICOS"]
["Acero baja aleación",110,"Bloque de material con 93% de acero primario 5% de restos 1% materiales de aleación","F6","METALES_FÉRRICOS"]
["Aluminio 100% rec",60,"Bloques de material con materiales secundarios","NF1","METALES_NO_FÉRRICOS"]
["Aluminio 0% rec",780,"Bloques de material con materiales primarios","NF2","METALES_NO_FÉRRICOS"]
["Cromo",970,"Bloques de material con materiales primarios","NF3","METALES_NO_FÉRRICOS"]
["Cobre",1400,"Bloques de material con materiales primarios","NF4","METALES_NO_FÉRRICOS"]
["Plomo",640,"Bloque de material que contiene 50% de plomo secundario","NF5","METALES_NO_FÉRRICOS"]
["Niquel enriquecido",5200,"Bloques de material con materiales primarios","NF6","METALES_NO_FÉRRICOS"]
["Zinc",3200,"Bloques de material con materiales primarios","NF7","METALES_NO_FÉRRICOS"]
["Curvado-aluminio",4.6999999999999997E-5,"Una hoja de 1mm de espesor de 1 m de ancho curvada 90 ","M1","METALES"]
{"$rows_left_out":78}
{"sheet":"INFO MATERIALES","index":8,"n_rows":152,"n_cols":4,"rows_kept":152,"cut":false,"hidden":false,"merged":[[39,0,39,3],[26,0,26,3],[14,0,14,3],[124,0,124,3],[109,0,109,3],[87,0,87,3],[69,0,69,3],[59,0,59,3],[53,0,53,3],[52,0,52,2],[58,0,58,2],[68,0,68,2],[86,0,86,2],[108,0,108,2],[123,0,123,2],[2,0,2,2],[13,0,13,2],[25,0,25,2],[38,0,38,2],[3,0,3,3]]}
["INDICADORES"]
[]
["Metales férricos (en milipuntos por KG)"]
["METALES FÉRRICOS"]
["Material","Indicador ","Descripción","código"]
["Hiero fundido ",240,"Hierro fundido con >2% de carbón","F1"]
["Acero de convertidores",94,"Bloque de material con acero primario","F2"]
["Acero de arco eléctrico",24,"Bloque de material con chatarra","F3"]
["Acero ",86,"Bloque de material 80% primario 20% chatarra","F4"]
["Acero alta aleación ",910,"Bloque de material con 71% acero primario y otros componentes","F5"]
["Acero baja aleación",110,"Bloque de material con 93% de acero primario 5% de restos 1% materiales de aleación","F6"]
[]
[]
["Metales NO férricos (en milipuntos por KG)"]
["Metales NO férricos "]
{"$rows_left_out":138}
{"sheet":"INFO D","index":9,"n_rows":5,"n_cols":4,"rows_kept":5,"cut":false,"hidden":false,"merged":[]}
["MILIPUNTOS MINIMO","MILIPUNTOS MAXIMO","NIVEL DE IMPACTO","CAUSA"]
[0,0,"NULO","No afectación al medio ambiente "]
[0.1,10000,"BAJO ","Baja afectación con recuperación en un 1 año"]
[10001,50000,"MEDIO ","Media afectación, el ecosistema tarde 1-10 años en recuperarse"]
[50002,100000,"ALTO","Periodo de recuperación mayor a 10 años"]

{"sheet":"PROYECTO CASA","index":10,"n_rows":34,"n_cols":7,"rows_kept":34,"cut":false,"hidden":false,"merged":[[32,6,32,8]]}
["Actividad ","Subactividad","Unidad","cantidad","Kg","total"]
["PRELIMINARES","Replanteo","M2",213,null,{"$f":"(Tabla32[[#This Row],[Kg]]*Tabla32[[#This Row],[cantidad]])","v":0}]
["PRELIMINARES","Descapote manual","M2",120,null,{"$f":"(Tabla32[[#This Row],[Kg]]*Tabla32[[#This Row],[cantidad]])","v":0}]
["CIMENTACIÓN ","Zapata aislada","M3",5,null,{"$f":"(Tabla32[[#This Row],[Kg]]*Tabla32[[#This Row],[cantidad]])","v":0}]
["CIMENTACIÓN ","Placa maciza","M2",120,null,{"$f":"(Tabla32[[#This Row],[Kg]]*Tabla32[[#This Row],[cantidad]])","v":0}]
["ESTRUCTURA","Columna ","M3",9,null,{"$f":"(Tabla32[[#This Row],[Kg]]*Tabla32[[#This Row],[cantidad]])","v":0}]
["ESTRUCTURA","Placa aligerada","M3",48,null,{"$f":"(Tabla32[[#This Row],[Kg]]*Tabla32[[#This Row],[cantidad]])","v":0}]
["ESTRUCTURA","Pantalla ","M3",3.6,null,{"$f":"(Tabla32[[#This Row],[Kg]]*Tabla32[[#This Row],[cantidad]])","v":0}]
["MUROS","Mampostería bloque","M2",190,null,{"$f":"(Tabla32[[#This Row],[Kg]]*Tabla32[[#This Row],[cantidad]])","v":0}]
["MUROS","Drywall ","M2",20,null,{"$f":"(Tabla32[[#This Row],[Kg]]*Tabla32[[#This Row],[cantidad]])","v":0}]
["INSTALACIONES","Instalaciones eléctricas","ML",80,null,{"$f":"(Tabla32[[#This Row],[Kg]]*Tabla32[[#This Row],[cantidad]])","v":0}]
["INSTALACIONES","Instalaciones sanitarias","ML",40,null,{"$f":"(Tabla32[[#This Row],[Kg]]*Tabla32[[#This Row],[cantidad]])","v":0}]
["INSTALACIONES","Instalaciones hidráulicas ","ML",40,null,{"$f":"(Tabla32[[#This Row],[Kg]]*Tabla32[[#This Row],[cantidad]])","v":0}]
["ACABADO","Pañete ","M2",{"$f":"(190*2)","v":380},null,{"$f":"(Tabla32[[#This Row],[Kg]]*Tabla32[[#This Row],[cantidad]])","v":0}]
["ACABADO","Estuco","M2",{"$f":"(190*2)","v":380},null,{"$f":"(Tabla32[[#This Row],[Kg]]*Tabla32[[#This Row],[cantidad]])","v":0}]
{"$rows_left_out":20}
{"sheet":"DINAMXACTIV (ACTUALIZAR","index":11,"n_rows":157,"n_cols":5,"rows_kept":157,"cut":false,"hidden":false,"merged":[]}
["ENTRADAS "]
[]
["Etiquetas de fila","Suma de milipuntos"]
["ACABADO",467541.9]
["barandas",2400]
["Divisiones en vidrio",4698]
["enchape porcelanato ",347200]
["envolvente especial",28500]
["Estuco",297]
["Pañete ",1207.1999999999998]
["Pintura vinilo ",34320]
["Piso en gres",28069.7]
["Puertas madera",330]
["Ventanas aluminio",20520]
["CIMENTACIÓN ",14525]
{"$rows_left_out":143}
{"sheet":"DINAMICA PROCESO (ACTUALIZAR)","index":12,"n_rows":70,"n_cols":2,"rows_kept":70,"cut":false,"hidden":false,"merged":[]}
["ENTRADAS ",1]
[]
["Etiquetas de fila","Suma de milipuntos"]
["ACABADO",467541.9]
["CIMENTACIÓN ",14525]
["ESTRUCTURA",132706]
["INSTALACIONES",13632]
["MUROS",2505.6]
["PRELIMINARES",683]
["Total general",631593.5]
[]
[]
[]
[]
[]
{"$rows_left_out":56}
{"sheet":"DASHBOARD","index":13,"n_rows":28,"n_cols":7,"rows_kept":28,"cut":false,"hidden":false,"merged":[[26,3,28,3],[3,0,3,2],[12,4,12,5],[14,4,14,5],[15,4,15,5],[18,0,18,4],[4,0,4,2],[11,1,11,2],[12,1,12,2],[27,1,28,2]]}
["EVALUACIÓN AMBIENTAL PARA EDIFICACIONES "]
[]
[]
["Nombre del proyecto"]
[{"$f":"+'1-INFORMACION GENERAL'!A6:C6","v":"VIVIENDA UNIFAMILIAR "}]
[]
[]
["Dirección"]
[{"$f":"+'1-INFORMACION GENERAL'!A10:C10","v":"AV 2 # 29-13 LA RINCONADA. CUCUTA-COLOMBIA"}]
[]
["Localización",null,null,null,"PROCESO CONSTRUCTIVO"]
["Pais","Departamento /Provincia",null,null,"Sistema constructivo"]
[{"$f":"+P","v":"COLOMBIA"},{"$f":"+'1-INFORMACION GENERAL'!B14","v":"Norte de Santander"},null,null,{"$f":"+'1-INFORMACION GENERAL'!A22","v":"VIGA-COLUMNA"}]
[]
["Uso del suelo ","Tipología  uso","Numero de pisos",null,"Proceso"]
{"$rows_left_out":13}