{"text_format":"1","workbook":"xlsx","n_sheets":6,"sheets":["Pasos del software","Analisis","Enc. de Criterios","Enc. de Alternativas","Bruto","Calculo de los criterios"],"not_rendered":{"charts":3,"images":1,"macros":1,"external_links":0,"defined_names":31,"comments":0,"pivot_tables":0},"unopened":[],"bounds":{"document_bytes":16777216,"sheet_cells":100000,"rows_first":2000,"rows_last":500,"rows_between":2000,"halvings":0,"cell_chars":16384,"cell_head_chars":4096},"cells_cut":0,"cells_raw":0,"read":"whole","date_system":"1900"}

{"sheet":"Pasos del software","index":0,"n_rows":26,"n_cols":8,"rows_kept":26,"cut":false,"hidden":false,"merged":[[1,4,4,12]]}
[]
[null,null,null,null,"Pasos para la aplicación del  AHP a los riesgos en Proyectos"]
[]
[]
[]
[]
[]
["*","Para el correcto uso de esta aplicacion se sugiere contraer la cinta de opciones:"]
[]
[]
[]
[]
["1)","Presionar para el inicio del proyecto:"]
[]
["2)","Comienzo de la encuesta de Criterios:"]
[]
["3)","Comienzo de la encuesta de Alternativas con respecto a los crierios:",null,null,null,null,null,"\"Alternativas en base al criterio x\""]
[]
[null,"a)",null,null,"d)"]
[]
{"$rows_left_out":7}
{"sheet":"Analisis","index":1,"n_rows":139,"n_cols":33,"rows_kept":139,"cut":false,"hidden":false,"merged":[[112,3,112,4],[112,14,112,17],[7,3,7,9],[122,1,124,6],[103,24,103,25],[104,24,104,25],[105,24,105,25],[106,24,106,25],[107,24,107,25],[108,24,108,25],[109,24,109,25],[115,14,115,15],[116,14,116,15],[117,14,117,15],[113,16,113,17],[114,16,114,17],[115,16,115,17],[116,16,116,17],[117,16,117,17],[105,10,105,11],[106,10,106,11],[107,10,107,11],[108,10,108,11],[109,10,109,11],[109,12,109,13],[109,14,109,15],[109,16,109,17],[109,18,109,19],[109,20,109,21],[109,22,109,23],[101,14,101,19],[113,14,113,15],[114,14,114,15],[107,12,107,13],[107,14,107,15],[107,16,107,17],[107,18,107,19],[107,20,107,21],[107,22,107,23],[108,12,108,13],[108,14,108,15],[108,16,108,17],[108,18,108,19],[108,20,108,21],[108,22,108,23],[105,12,105,13],[105,14,105,15],[105,16,105,17],[105,18,105,19],[105,20,105,21],[105,22,105,23],[106,12,106,13],[106,14,106,15],[106,16,106,17],[106,18,106,19],[106,20,106,21],[106,22,106,23],[101,3,101,5],[103,12,103,13],[103,14,103,15],[103,16,103,17],[103,18,103,19],[103,20,103,21],[103,22,103,23],[104,12,104,13],[104,14,104,15],[104,16,104,17],[104,18,104,19],[104,20,104,21],[104,22,104,23],[44,0,45,2],[17,2,17,3],[17,4,17,5],[18,4,18,5],[19,4,19,5],[99,0,100,2],[41,0,42,2],[47,3,47,4],[49,1,49,2],[50,1,50,2],[36,0,38,5],[25,2,26,4],[51,1,51,2],[52,1,52,2],[53,1,53,2],[54,1,54,2],[56,0,56,2],[66,0,67,2],[75,1,75,2],[70,1,70,2],[96,0,97,2],[58,0,59,1],[63,0,64,3],[66,3,67,15],[6,13,7,26],[10,13,12,26],[20,12,21,13],[15,17,16,18],[15,14,16,15],[15,11,16,12],[15,20,16,21],[20,15,21,16],[15,23,16,24],[15,26,16,27],[20,18,21,19],[20,21,21,22],[20,24,21,25],[75,7,75,8],[69,3,69,4],[71,1,71,2],[72,1,72,2],[73,1,73,2],[0,0,2,8],[8,3,8,4],[9,3,9,4],[7,0,7,2],[8,0,8,2],[9,0,9,2],[4,4,5,6],[21,4,21,5],[20,2,20,3],[21,2,21,3],[11,2,11,3],[11,4,11,5],[18,2,18,3],[19,2,19,3],[15,2,16,3],[15,4,16,5],[20,4,20,5],[22,4,22,5],[22,2,22,3],[71,19,71,20],[72,19,72,20],[70,15,70,18],[70,19,70,20],[70,21,70,22],[69,19,69,22],[71,15,71,18],[71,21,71,22],[74,1,74,2],[72,21,72,22],[73,21,73,22],[74,21,74,22],[69,9,69,10],[70,7,70,8],[71,7,71,8],[72,7,72,8],[73,7,73,8],[74,7,74,8],[75,21,75,22],[73,19,73,20],[74,19,74,20],[75,19,75,20],[72,15,72,18],[73,15,73,18],[74,15,74,18],[75,15,75,18],[89,1,89,2],[84,1,84,2],[85,1,85,2],[86,1,86,2],[87,1,87,2],[88,1,88,2],[77,15,77,16],[78,15,78,16],[77,17,77,18],[78,17,78,18],[83,3,83,4],[83,9,83,10],[87,15,87,18],[87,19,87,20],[87,21,87,22],[88,15,88,18],[84,7,84,8],[85,7,85,8],[86,7,86,8],[87,7,87,8],[88,7,88,8],[83,19,83,22],[84,15,84,18],[84,19,84,20],[84,21,84,22],[85,15,85,18],[85,19,85,20],[85,21,85,22],[86,15,86,18],[86,19,86,20],[86,21,86,22],[92,15,92,16],[92,17,92,18],[88,21,88,22],[89,15,89,18],[89,19,89,20],[89,21,89,22],[91,15,91,16],[91,17,91,18],[89,7,89,8],[88,19,88,20]]}
["Aplicación de la tecnica AHP a Proyectos"]
[]
[]
[]
[null,null,null,null,"1. (Presionar \"Inicio del Proyecto\")"]
[]
[null,null,null,null,null,null,null,null,null,null,null,null,null,"Estructura Jerárquica"]
["Nombre",null,null,"Destinos Erasmus"]
["Número de Criterios",null,null,3]
["Número de Alternativas",null,null,3]
[null,null,null,null,null,null,null,null,null,null,null,null,null,{"$f":"+D8","v":"Destinos Erasmus"},null,null,null,null,null,null,null,null,null,null,null,null,null,null,null,null,null,null,1]
[null,null,"2. Definir los Criterios",null,"3. Definir las Alternativas",null,null,null,null,null,null,null,null,null,null,null,null,null,null,null,null,null,null,null,null,null,null,null,null,null,null,null,3]
[null,null,null,null,null,null,null,null,null,null,null,null,null,null,null,null,null,null,null,null,null,null,null,null,null,null,null,null,null,null,null,null,5]
[null,null,null,null,null,null,null,null,null,null,null,null,null,null,null,null,null,null,null,null,null,null,null,null,null,null,null,null,null,null,null,null,7]
[null,null,null,null,null,null,null,null,null,null,null,null,null,null,null,null,null,null,null,null,null,null,null,null,null,null,null,null,null,null,null,null,9]
[null,null,"Nombre de Criterios",null,"Nombre de Alternativas",null,null,null,null,null,null,{"$f":"+IF(C22<>\"\",C22,\"\")","v":""},null,null,{"$f":"+IF(C20<>\"\",C18,\"\")","v":"Formación"},null,null,{"$f":"IF(C18=\"\",\"\",IF(C20=\"\",C18,C19))","v":"Costo de Vida"},null,null,{"$f":"IF(C19=\"\",\"\",IF(C20=\"\",C19,C20))","v":"Ocio"},null,null,{"$f":"+IF(C21<>\"\",C21,\"\")","v":""},null,null,{"$f":"+IF(G23=6,C23,\"\")","v":""},null,null,null,null,null,2]
[null,null,null,null,null,null,null,null,null,null,null,null,null,null,null,null,null,null,null,null,null,null,null,null,null,null,null,null,null,null,null,null,4]
[null,1,"Formación",null,"Munchen",null,{"$f":"+IF(C18=\"\",\"\",1)","v":1},{"$f":"+IF(E18=\"\",\"\",1)","v":1},null,null,null,null,null,null,null,null,null,null,null,null,null,null,null,null,null,null,null,null,null,null,null,null,6]
[null,2,"Costo de Vida",null,"London",null,{"$f":"+IF(C19=\"\",\"\",2)","v":2},{"$f":"+IF(E19=\"\",\"\",2)","v":2},null,null,null,null,null,null,null,null,null,null,null,null,null,null,null,null,null,null,null,null,null,null,null,null,8]
[null,3,"Ocio",null,"Praga",null,{"$f":"+IF(C20=\"\",\"\",3)","v":3},{"$f":"+IF(E20=\"\",\"\",3)","v":3}]
{"$rows_left_out":120}
{"sheet":"Enc. de Criterios","index":2,"n_rows":42,"n_cols":21,"rows_kept":42,"cut":false,"hidden":false,"merged":[[41,9,43,11],[29,6,29,7],[27,6,27,7],[25,6,25,7],[39,6,39,7],[37,6,37,7],[35,6,35,7],[33,6,33,7],[31,6,31,7],[10,0,10,3],[10,4,10,5],[0,0,1,2],[3,0,4,2],[23,6,23,7],[21,6,21,7],[19,6,19,7],[17,6,17,7],[15,6,15,7],[13,6,13,7],[10,6,10,7],[11,6,11,7],[21,18,22,19],[23,18,24,19],[25,18,26,19],[27,18,28,19],[13,20,16,21],[17,20,18,21],[19,20,20,21],[21,20,22,21],[23,20,24,21],[25,20,26,21],[27,20,28,21],[13,18,16,19],[17,18,18,19],[19,18,20,19]]}
["Encuestas"]
[]
[]
["Criterios"]
[]
["Nota:","En esta sección la evaluación sera tomando como referencia el primer criterio con respecto al segundo"]
["Ejemplo:","Si el riesgo de que A es 3 veces mas importante que el riesgo de B, se colocara el valor de 3; si en cambio la relación es 1/3, se marcará la casilla de inversa."]
[]
[null,"A vs B",null,null,false,null,3,null,{"$f":"+IF(E9=FALSE,G9,1/G9)","v":3}]
[]
["Relación de criterios",null,null,null,"Inverso de la relación",null,"Calificación"]
[{"$f":"IF(Analisis!D9>=2,+CONCATENATE(Analisis!C18,\" \",\"vs\",\" \",Analisis!C19),\"\")","v":"Formación vs Costo de Vida"},null,null,null,false,null,5,null,{"$f":"+IF(A12=\"\",\"\",IF(E12=TRUE,G12,1/G12))","v":0.2},{"$f":"+IF(A12=\"\",\"\",1/I12)","v":5},{"$f":"+IF(A12=\"\",\"\",CONCATENATE(Analisis!C18,\" es \",J12,\" veces más importante que \",Analisis!C19))","v":"Formación es 5 veces más importante que Costo de Vida"}]
[]
[{"$f":"IF(Analisis!D9>=3,+CONCATENATE(Analisis!C18,\" \",\"vs\",\" \",Analisis!C20),\"\")","v":"Formación vs Ocio"},null,null,null,false,null,7,null,{"$f":"+IF(A14=\"\",\"\",IF(E14=TRUE,G14,1/G14))","v":0.14285714285714285},{"$f":"+IF(A14=\"\",\"\",1/I14)","v":7},{"$f":"+IF(A14=\"\",\"\",CONCATENATE(Analisis!C18,\" es \",J14,\" veces más importante que \",Analisis!C20))","v":"Formación es 7 veces más importante que Ocio"},null,null,null,null,null,null,null,"Intensidad de importancia",null,"Definición"]
[]
[{"$f":"IF(Analisis!D9>=3,+CONCATENATE(Analisis!C19,\" \",\"vs\",\" \",Analisis!C20),\"\")","v":"Costo de Vida vs Ocio"},null,null,null,false,null,3,null,{"$f":"+IF(A16=\"\",\"\",IF(E16=TRUE,G16,1/G16))","v":0.33333333333333331},{"$f":"+IF(A16=\"\",\"\",1/I16)","v":3},{"$f":"+IF(A16=\"\",\"\",CONCATENATE(Analisis!C19,\" es \",J16,\" veces más importante que \",Analisis!C20))","v":"Costo de Vida es 3 veces más importante que Ocio"}]
[]
[{"$f":"IF(Analisis!D9>=4,+CONCATENATE(Analisis!C18,\" \",\"vs\",\" \",Analisis!C21),\"\")","v":""},null,null,null,false,null,null,null,{"$f":"+IF(A18=\"\",\"\",IF(E18=TRUE,G18,1/G18))","v":""},{"$f":"+IF(A18=\"\",\"\",1/I18)","v":""},{"$f":"+IF(A18=\"\",\"\",CONCATENATE(Analisis!C18,\" es \",J18,\" veces más importante que \",Analisis!C21))","v":""},null,null,null,null,null,null,null,1,null,"IGUAL"]
[]
[{"$f":"IF(Analisis!D9>=4,+CONCATENATE(Analisis!C19,\" \",\"vs\",\" \",Analisis!C21),\"\")","v":""},null,null,null,false,null,null,null,{"$f":"+IF(A20=\"\",\"\",IF(E20=TRUE,G20,1/G20))","v":""},{"$f":"+IF(A20=\"\",\"\",1/I20)","v":""},{"$f":"+IF(A20=\"\",\"\",CONCATENATE(Analisis!C19,\" es \",J20,\" veces más importante que \",Analisis!C21))","v":""},null,null,null,null,null,null,null,3,null,"MODERADO"]
{"$rows_left_out":23}
{"sheet":"Enc. de Alternativas","index":3,"n_rows":229,"n_cols":20,"rows_kept":229,"cut":false,"hidden":false,"merged":[[161,0,161,5],[200,0,200,5],[148,9,149,11],[138,6,138,7],[140,6,140,7],[142,6,142,7],[144,6,144,7],[146,6,146,7],[187,6,187,7],[173,6,173,7],[175,6,175,7],[177,6,177,7],[179,6,179,7],[181,6,181,7],[156,0,157,2],[189,9,190,11],[168,0,168,3],[168,4,168,5],[168,6,168,7],[169,6,169,7],[171,6,171,7],[195,0,196,2],[110,9,111,11],[115,0,116,2],[136,6,136,7],[127,0,127,3],[127,4,127,5],[127,6,127,7],[128,6,128,7],[130,6,130,7],[132,6,132,7],[134,6,134,7],[120,0,120,5],[100,6,100,7],[102,6,102,7],[104,6,104,7],[108,6,108,7],[98,6,98,7],[89,0,89,3],[89,4,89,5],[89,6,89,7],[90,6,90,7],[94,6,94,7],[96,6,96,7],[92,6,92,7],[106,6,106,7],[65,6,65,7],[67,6,67,7],[71,9,72,11],[69,6,69,7],[53,6,53,7],[55,6,55,7],[57,6,57,7],[59,6,59,7],[82,0,82,5],[77,0,78,2],[38,0,39,2],[33,9,34,11],[50,0,50,3],[50,4,50,5],[50,6,50,7],[43,0,43,5],[51,6,51,7],[61,6,61,7],[63,6,63,7],[27,6,27,7],[29,6,29,7],[31,6,31,7],[0,0,1,2],[17,6,17,7],[19,6,19,7],[21,6,21,7],[23,6,23,7],[25,6,25,7],[12,4,12,5],[12,6,12,7],[13,6,13,7],[15,6,15,7],[12,0,12,3],[5,0,5,5],[224,6,224,7],[207,0,207,3],[207,4,207,5],[207,6,207,7],[183,6,183,7],[185,6,185,7],[228,9,229,11],[226,6,226,7],[208,6,208,7],[210,6,210,7],[212,6,212,7],[214,6,214,7],[216,6,216,7],[218,6,218,7],[220,6,220,7],[222,6,222,7],[23,17,24,18],[23,19,24,20],[25,17,26,18],[25,19,26,20],[27,17,28,18],[27,19,28,20],[15,17,18,18],[15,19,18,20],[19,17,20,18],[19,19,20,20],[21,17,22,18],[21,19,22,20],[59,17,60,18],[59,19,60,20],[61,17,62,18],[61,19,62,20],[63,17,64,18],[63,19,64,20],[29,17,30,18],[29,19,30,20],[53,17,56,18],[53,19,56,20],[57,17,58,18],[57,19,58,20],[96,17,97,18],[96,19,97,20],[98,17,99,18],[98,19,99,20],[100,17,101,18],[100,19,101,20],[65,17,66,18],[65,19,66,20],[67,17,68,18],[67,19,68,20],[92,17,95,18],[92,19,95,20],[130,17,133,18],[130,19,133,20],[134,17,135,18],[134,19,135,20],[136,17,137,18],[136,19,137,20],[102,17,103,18],[102,19,103,20],[104,17,105,18],[104,19,105,20],[106,17,107,18],[106,19,107,20],[144,17,145,18],[144,19,145,20],[171,17,174,18],[171,19,174,20],[175,17,176,18],[175,19,176,20],[138,17,139,18],[138,19,139,20],[140,17,141,18],[140,19,141,20],[142,17,143,18],[142,19,143,20],[183,17,184,18],[183,19,184,20],[185,17,186,18],[185,19,186,20],[210,17,213,18],[210,19,213,20],[177,17,178,18],[177,19,178,20],[179,17,180,18],[179,19,180,20],[181,17,182,18],[181,19,182,20],[220,17,221,18],[220,19,221,20],[222,17,223,18],[222,19,223,20],[224,17,225,18],[224,19,225,20],[214,17,215,18],[214,19,215,20],[216,17,217,18],[216,19,217,20],[218,17,219,18],[218,19,219,20]]}
["Alternativas"]
[]
[]
[]
[]
[{"$f":"+IF(Analisis!$D$9>=1,Analisis!C18,\"\")","v":"Formación"},null,null,null,null,null,"\"1\""]
[]
["Nota:","En esta sección la evaluación sera tomando como referencia la primera alternativa con respecto a la segunda"]
["Ejemplo:","Si el riesgo de que A es 3 veces mas importante que el riesgo de B, se colocara el valor de 3; si en cambio la relación es 1/3, se marcará la casilla de inversa."]
[]
[null,"A vs B",null,null,false,null,3,null,{"$f":"+IF(E11=FALSE,G11,1/G11)","v":3}]
[]
["Relacion de criterios",null,null,null,"Inverso de la relación",null,"Calificación"]
[{"$f":"IF(A6=\"\",\"\",IF(Analisis!D10>=2,+CONCATENATE(Analisis!E18,\" \",\"vs\",\" \",Analisis!E19),\"\"))","v":"Munchen vs London"},null,null,null,false,null,3,null,{"$f":"+IF(A14=\"\",\"\",IF(E14=TRUE,G14,1/G14))","v":0.33333333333333331},{"$f":"+IF(A14=\"\",\"\",1/I14)","v":3},{"$f":"+IF(A14=\"\",\"\",CONCATENATE(Analisis!$E$18,\" es \",J14,\" más importante que \",Analisis!$E$19))","v":"Munchen es 3 más importante que London"}]
[]
[{"$f":"IF(A6=\"\",\"\",IF(Analisis!D10>=3,+CONCATENATE(Analisis!E18,\" \",\"vs\",\" \",Analisis!E20),\"\"))","v":"Munchen vs Praga"},null,null,null,false,null,7,null,{"$f":"+IF(A16=\"\",\"\",IF(E16=TRUE,G16,1/G16))","v":0.14285714285714285},{"$f":"+IF(A16=\"\",\"\",1/I16)","v":7},{"$f":"+IF(A16=\"\",\"\",CONCATENATE(Analisis!$E$18,\" es \",J16,\" más importante que \",Analisis!$E$20))","v":"Munchen es 7 más importante que Praga"},null,null,null,null,null,null,"Intensidad de importancia",null,"Definición"]
[]
[{"$f":"IF(A6=\"\",\"\",IF(Analisis!D10>=3,+CONCATENATE(Analisis!E19,\" \",\"vs\",\" \",Analisis!E20),\"\"))","v":"London vs Praga"},null,null,null,false,null,4,null,{"$f":"+IF(A18=\"\",\"\",IF(E18=TRUE,G18,1/G18))","v":0.25},{"$f":"+IF(A18=\"\",\"\",1/I18)","v":4},{"$f":"+IF(A18=\"\",\"\",CONCATENATE(Analisis!$E$19,\" es \",J18,\" más importante que \",Analisis!$E$20))","v":"London es 4 más importante que Praga"}]
[]
[{"$f":"IF(A6=\"\",\"\",IF(Analisis!D10>=4,+CONCATENATE(Analisis!E18,\" \",\"vs\",\" \",Analisis!E21),\"\"))","v":""},null,null,null,false,null,null,null,{"$f":"+IF(A20=\"\",\"\",IF(E20=TRUE,G20,1/G20))","v":""},{"$f":"+IF(A20=\"\",\"\",1/I20)","v":""},{"$f":"+IF(A20=\"\",\"\",CONCATENATE(Analisis!$E$18,\" es \",J20,\" más importante que \",Analisis!$E$21))","v":""},null,null,null,null,null,null,1,null,"IGUAL"]
{"$rows_left_out":210}
{"sheet":"Bruto","index":4,"n_rows":81,"n_cols":39,"rows_kept":81,"cut":false,"hidden":true,"merged":[[64,12,64,14],[65,12,65,14],[66,12,66,14],[67,12,67,14],[59,12,59,14],[60,12,60,14],[61,12,61,14],[62,12,62,14],[63,12,63,14],[74,12,74,14],[75,12,75,14],[76,12,76,14],[77,12,77,14],[78,12,78,14],[80,12,80,14],[75,6,75,8],[76,6,76,8],[77,6,77,8],[78,6,78,8],[79,6,79,8],[80,6,80,8],[79,12,79,14],[68,12,68,14],[69,0,69,2],[71,6,71,8],[72,6,72,8],[73,6,73,8],[71,12,71,14],[72,12,72,14],[73,12,73,14],[74,6,74,8],[66,0,66,2],[66,6,66,8],[67,0,67,2],[67,6,67,8],[68,0,68,2],[68,6,68,8],[62,0,62,2],[62,6,62,8],[63,6,63,8],[64,6,64,8],[65,0,65,2],[65,6,65,8],[59,0,59,2],[59,6,59,8],[60,0,60,2],[60,6,60,8],[61,0,61,2],[61,6,61,8],[55,0,55,2],[55,6,55,8],[55,12,55,14],[56,0,56,2],[56,6,56,8],[56,12,56,14],[52,6,52,8],[52,12,52,14],[53,6,53,8],[53,12,53,14],[54,0,54,2],[54,6,54,8],[54,12,54,14],[50,0,50,2],[50,6,50,8],[50,12,50,14],[51,0,51,2],[51,6,51,8],[51,12,51,14],[49,6,49,8],[49,12,49,14],[13,1,17,1],[18,1,22,1],[23,1,27,1],[28,1,32,1],[33,1,37,1],[38,1,42,1],[47,0,47,2],[47,6,47,8],[47,12,47,14],[48,6,48,8],[48,12,48,14],[3,3,3,8],[3,9,3,38],[5,9,5,13],[5,14,5,18],[5,19,5,23],[5,24,5,28],[5,29,5,33],[5,34,5,38]]}
[null,null,null,1,2,3,4,5,6,7,8,9,10]
[null,null,null,0,1E-4,0.52,0.89,1.1100000000000001,1.25,1.35,1.4,1.45,1.49]
[]
[null,null,null,"CRITERIOS",null,null,null,null,null,"ALTERNATIVAS"]
[]
[null,null,null,null,null,null,null,null,null,{"$f":"+D7","v":"Formación"},null,null,null,null,{"$f":"+E7","v":"Costo de Vida"},null,null,null,null,{"$f":"+F7","v":"Ocio"},null,null,null,null,{"$f":"+G7","v":0},null,null,null,null,{"$f":"+H7","v":0},null,null,null,null,{"$f":"+I7","v":0}]
[null,null,null,{"$f":"+Analisis!C18","v":"Formación"},{"$f":"+C9","v":"Costo de Vida"},{"$f":"+C10","v":"Ocio"},{"$f":"+C11","v":0},{"$f":"+C12","v":0},{"$f":"+C13","v":0},{"$f":"+$C$14","v":"Munchen"},{"$f":"+$C$15","v":"London"},{"$f":"+$C$16","v":"Praga"},{"$f":"+$C$17","v":0},{"$f":"+$C$18","v":0},{"$f":"+$C$14","v":"Munchen"},{"$f":"+$C$15","v":"London"},{"$f":"+$C$16","v":"Praga"},{"$f":"+$C$17","v":0},{"$f":"+$C$18","v":0},{"$f":"+$C$14","v":"Munchen"},{"$f":"+$C$15","v":"London"},{"$f":"+$C$16","v":"Praga"},{"$f":"+$C$17","v":0},{"$f":"+$C$18","v":0},{"$f":"+$C$14","v":"Munchen"},{"$f":"+$C$15","v":"London"},{"$f":"+$C$16","v":"Praga"},{"$f":"+$C$17","v":0},{"$f":"+$C$18","v":0},{"$f":"+$C$14","v":"Munchen"},{"$f":"+$C$15","v":"London"},{"$f":"+$C$16","v":"Praga"},{"$f":"+$C$17","v":0},{"$f":"+$C$18","v":0},{"$f":"+$C$14","v":"Munchen"},{"$f":"+$C$15","v":"London"},{"$f":"+$C$16","v":"Praga"},{"$f":"+$C$17","v":0},{"$f":"+$C$18","v":0}]
[null,null,{"$f":"+D7","v":"Formación"},1,{"$f":"1/D9","v":5},{"$f":"+IF(D10=0,0,1/D10)","v":7},{"$f":"+IF(D11=0,0,1/D11)","v":0},{"$f":"+IF(D12=0,0,1/D12)","v":0},{"$f":"+IF(OR(D13=0,D13=\"\"),0,1/D13)","v":0},0,0,0,0,0,0,0,0,0,0,0,0,0,0,0,0,0,0,0,0,0,0,0,0,0,0,0,0,0,0]
[null,null,{"$f":"+Analisis!C19","v":"Costo de Vida"},{"$f":"+IF(Analisis!D9>=2,D48,0)","v":0.2},1,{"$f":"+IF(E10=0,0,1/E10)","v":3},{"$f":"+IF(E11=0,0,1/E11)","v":0},{"$f":"+IF(E12=0,0,1/E12)","v":0},{"$f":"+IF(OR(E13=0,E13=\"\"),0,1/E13)","v":0},0,0,0,0,0,0,0,0,0,0,0,0,0,0,0,0,0,0,0,0,0,0,0,0,0,0,0,0,0,0]
[null,null,{"$f":"+Analisis!C20","v":"Ocio"},{"$f":"+IF(Analisis!D9>=3,D51,0)","v":0.14285714285714285},{"$f":"+IF(Analisis!D9>=3,D52,0)","v":0.33333333333333331},1,{"$f":"+IF(F11=0,0,1/F11)","v":0},{"$f":"+IF(F12=0,0,1/F12)","v":0},{"$f":"+IF(OR(F13=0,F13=\"\"),0,1/F13)","v":0},0,0,0,0,0,0,0,0,0,0,0,0,0,0,0,0,0,0,0,0,0,0,0,0,0,0,0,0,0,0]
[null,null,{"$f":"+Analisis!C21","v":0},{"$f":"+IF(Analisis!D9>=4,D55,0)","v":0},{"$f":"+IF(Analisis!D9>=4,D56,0)","v":0},{"$f":"+IF(Analisis!D9>=4,D57,0)","v":0},1,{"$f":"+IF(G12=0,0,1/G12)","v":0},{"$f":"+IF(OR(G13=0,G13=\"\"),0,1/G13)","v":0},0,0,0,0,0,0,0,0,0,0,0,0,0,0,0,0,0,0,0,0,0,0,0,0,0,0,0,0,0,0]
[null,null,{"$f":"+Analisis!C22","v":0},{"$f":"+IF(Analisis!D9>=5,D60,0)","v":0},{"$f":"+IF(Analisis!$D$9>=5,D61,0)","v":0},{"$f":"+IF(Analisis!$D$9>=5,D62,0)","v":0},{"$f":"+IF(Analisis!$D$9>=5,D63,0)","v":0},1,{"$f":"+IF(OR(H13=0,H13=\"\"),0,1/H13)","v":0},0,0,0,0,0,0,0,0,0,0,0,0,0,0,0,0,0,0,0,0,0,0,0,0,0,0,0,0,0,0]
[null,null,{"$f":"+Analisis!C23","v":0},{"$f":"+IF(Analisis!D9>=5,D66,0)","v":0},{"$f":"+IF(Analisis!$D$9>=5,D67,0)","v":0},{"$f":"+IF(Analisis!$D$9>=5,D68,0)","v":0},{"$f":"+IF(Analisis!$D$9>=5,D69,0)","v":0},{"$f":"+IF(Analisis!$D$9>=5,D70,0)","v":0},1,0,0,0,0,0,0,0,0,0,0,0,0,0,0,0,0,0,0,0,0,0,0,0,0,0,0,0,0,0,0]
[null,{"$f":"+C8","v":"Formación"},{"$f":"+Analisis!$E$18","v":"Munchen"},0,0,0,0,0,0,1,{"$f":"1/J15","v":0.33333333333333331},{"$f":"+IF(J16=0,0,1/J16)","v":0.14285714285714285},{"$f":"+IF(J17=0,0,1/J17)","v":0},{"$f":"+IF(J18=0,0,1/J18)","v":0},0,0,0,0,0,0,0,0,0,0,0,0,0,0,0,0,0,0,0,0,0,0,0,0,0]
[null,null,{"$f":"+Analisis!$E$19","v":"London"},0,0,0,0,0,0,{"$f":"+IF(Analisis!$D$10>=2,J48,0)","v":3},1,{"$f":"+IF(K16=0,0,1/K16)","v":0.25},{"$f":"+IF(K17=0,0,1/K17)","v":0},{"$f":"+IF(K18=0,0,1/K18)","v":0},0,0,0,0,0,0,0,0,0,0,0,0,0,0,0,0,0,0,0,0,0,0,0,0,0]
[null,null,{"$f":"+Analisis!$E$20","v":"Praga"},0,0,0,0,0,0,{"$f":"+IF(Analisis!$D$10>=3,J49,0)","v":7},{"$f":"+IF(Analisis!$D$10>=3,J50,0)","v":4},1,{"$f":"+IF(L17=0,0,1/L17)","v":0},{"$f":"+IF(L18=0,0,1/L18)","v":0},0,0,0,0,0,0,0,0,0,0,0,0,0,0,0,0,0,0,0,0,0,0,0,0,0]
[null,null,{"$f":"+Analisis!$E$21","v":0},0,0,0,0,0,0,{"$f":"+IF(Analisis!$D$10>=4,J51,0)","v":0},{"$f":"+IF(Analisis!$D$10>=4,J52,0)","v":0},{"$f":"+IF(Analisis!$D$10>=4,J53,0)","v":0},1,{"$f":"+IF(M18=0,0,1/M18)","v":0},0,0,0,0,0,0,0,0,0,0,0,0,0,0,0,0,0,0,0,0,0,0,0,0,0]
[null,null,{"$f":"+Analisis!$E$22","v":0},0,0,0,0,0,0,{"$f":"+IF(Analisis!$D$10>=5,J54,0)","v":0},{"$f":"+IF(Analisis!$D$10>=5,J55,0)","v":0},{"$f":"+IF(Analisis!$D$10>=5,J56,0)","v":0},{"$f":"+IF(Analisis!$D$10>=5,J57,0)","v":0},1,0,0,0,0,0,0,0,0,0,0,0,0,0,0,0,0,0,0,0,0,0,0,0,0,0]
[null,{"$f":"+C9","v":"Costo de Vida"},{"$f":"+Analisis!$E$18","v":"Munchen"},0,0,0,0,0,0,0,0,0,0,0,1,{"$f":"1/O20","v":0.33333333333333331},{"$f":"+IF(O21=0,0,1/O21)","v":4},{"$f":"+IF(O22=0,0,1/O22)","v":0},{"$f":"+IF(O23=0,0,1/O23)","v":0},0,0,0,0,0,0,0,0,0,0,0,0,0,0,0,0,0,0,0,0]
[null,null,{"$f":"+Analisis!$E$19","v":"London"},0,0,0,0,0,0,0,0,0,0,0,{"$f":"+IF(Analisis!$D$10>=2,J60,0)","v":3},1,{"$f":"+IF(P21=0,0,1/P21)","v":9},{"$f":"+IF(P22=0,0,1/P22)","v":0},{"$f":"+IF(P23=0,0,1/P23)","v":0},0,0,0,0,0,0,0,0,0,0,0,0,0,0,0,0,0,0,0,0]
{"$rows_left_out":62}
{"sheet":"Calculo de los criterios","index":5,"n_rows":225,"n_cols":33,"rows_kept":225,"cut":false,"hidden":false,"merged":[[1,1,1,4],[38,1,38,4]]}
[]
[null,"Criterios"]
[]
[null,"Metodo Aproximado"]
[]
[null,null,"Matriz resultante",null,"Categorias"]
[null,null,{"$f":"+COUNTIF(C9:C14,\">0\")","v":3}]
[null,null,{"$f":"+B9","v":"Formación"},{"$f":"+B10","v":"Costo de Vida"},{"$f":"+B11","v":"Ocio"},{"$f":"+B12","v":0},{"$f":"+B13","v":0},{"$f":"+B14","v":0},null,null,{"$f":"+C8","v":"Formación"},"Costo de Vida","Ocio",0,0,0,null,null,null,null,"λ","n","IC","CR"]
[null,{"$f":"+Analisis!C18","v":"Formación"},{"$f":"+Bruto!D8","v":1},{"$f":"+Bruto!E8","v":5},{"$f":"+Bruto!F8","v":7},{"$f":"+Bruto!G8","v":0},{"$f":"+Bruto!H8","v":0},{"$f":"+Bruto!I8","v":0},null,{"$f":"+B9","v":"Formación"},{"$f":"+C9/C$16","v":0.74468085106382986},0.78947368421052633,0.63636363636363635,0,0,0,null,{"$f":"+SUM(K9:P9)-K17","v":2.1705181716379927},{"$f":"IF(R9=0,\"\",R9/(6-Q17))","v":0.72350605721266426},null,{"$f":"+SUMPRODUCT(C16:H16,K15:P15)","v":3.1114637011613495},{"$f":"+COUNTIF(C9:H9,\">0\")","v":3},{"$f":"+(U9-V9)/(V9-1)","v":5.5731850580674758E-2},{"$f":"+W9/+HLOOKUP(V9,Bruto!D1:M2,2,FALSE)","v":0.10717663573206684},null,{"$f":"+IF(AD29=\"\",\"\",IF(X10>0.1,\"La matriz es inconsistente, se debe volver a evaluar\",\"La matriz es consistente\"))","v":"La matriz es inconsistente, se debe volver a evaluar"}]
[null,{"$f":"+Analisis!C19","v":"Costo de Vida"},{"$f":"+Bruto!D9","v":0.2},{"$f":"+Bruto!E9","v":1},{"$f":"+Bruto!F9","v":3},{"$f":"+Bruto!G9","v":0},{"$f":"+Bruto!H9","v":0},{"$f":"+Bruto!I9","v":0},null,"Costo de Vida",0.14893617021276598,0.15789473684210528,0.27272727272727271,0,0,0,null,{"$f":"+SUM(K10:P10)-L17","v":0.57955817978214397},{"$f":"IF(R10=0,\"\",R10/(6-Q17))","v":0.19318605992738133},null,null,null,null,{"$f":"+IF(X9<0,0,X9)","v":0.10717663573206684}]
[null,{"$f":"+Analisis!C20","v":"Ocio"},{"$f":"+Bruto!D10","v":0.14285714285714285},{"$f":"+Bruto!E10","v":0.33333333333333331},{"$f":"+Bruto!F10","v":1},{"$f":"+Bruto!G10","v":0},{"$f":"+Bruto!H10","v":0},{"$f":"+Bruto!I10","v":0},null,"Ocio",0.10638297872340426,5.2631578947368418E-2,9.0909090909090912E-2,0,0,0,null,{"$f":"+SUM(K11:P11)-M17","v":0.24992364857986357},{"$f":"IF(R11=0,\"\",R11/(6-Q17))","v":8.3307882859954524E-2}]
[null,{"$f":"+Analisis!C21","v":0},{"$f":"+Bruto!D11","v":0},{"$f":"+Bruto!E11","v":0},{"$f":"+Bruto!F11","v":0},{"$f":"+Bruto!G11","v":1},{"$f":"+Bruto!H11","v":0},{"$f":"+Bruto!I11","v":0},null,0,0,0,0,1,0,0,null,{"$f":"+SUM(K12:P12)-N17","v":0},{"$f":"IF(R12=0,\"\",R12/(6-Q17))","v":""},null,1,0,0,0,0,0,null,{"$f":"+(C9:H14-Z22*U12:Z17)","v":-2.0648875576076193},5,7,0,0,0]
[null,{"$f":"+Analisis!C22","v":0},{"$f":"+Bruto!D12","v":0},{"$f":"+Bruto!E12","v":0},{"$f":"+Bruto!F12","v":0},{"$f":"+Bruto!G12","v":0},{"$f":"+Bruto!H12","v":1},{"$f":"+Bruto!I12","v":0},null,0,0,0,0,0,1,0,null,{"$f":"+SUM(K13:P13)-O17","v":0},{"$f":"IF(R13=0,\"\",R13/(6-Q17))","v":""},null,0,1,0,0,0,0,null,0.2,-2.0648875576076193,3,0,0,0]
[null,{"$f":"+Analisis!C23","v":0},{"$f":"+Bruto!D13","v":0},{"$f":"+Bruto!E13","v":0},{"$f":"+Bruto!F13","v":0},{"$f":"+Bruto!G13","v":0},{"$f":"+Bruto!H13","v":0},{"$f":"+Bruto!I13","v":1},null,0,0,0,0,0,0,1,null,{"$f":"+SUM(K14:P14)-P17","v":0},{"$f":"IF(R14=0,\"\",R14/(6-Q17))","v":""},null,0,0,1,0,0,0,null,0.14285714285714285,0.33333333333333331,-2.0648875576076193,0,0,0]
[null,null,null,null,null,null,null,null,null,null,{"$f":"+S9","v":0.72350605721266426},{"$f":"+S10","v":0.19318605992738133},{"$f":"+S11","v":8.3307882859954524E-2},{"$f":"+S12","v":""},{"$f":"+S13","v":""},{"$f":"+S14","v":""},null,null,null,null,0,0,0,1,0,0,null,0,0,0,-2.0648875576076193,0,0]
[null,null,{"$f":"+SUMIF(C9:C14,\">0\",C9:C14)","v":1.3428571428571427},6.333333333333333,11,1,1,1,null,null,null,null,null,null,null,null,null,null,null,null,0,0,0,0,1,0,null,0,0,0,0,-2.0648875576076193,0]
[null,null,null,null,null,null,null,null,null,null,{"$f":"+IF(K9=1,1,0)","v":0},{"$f":"+IF(L10=1,1,0)","v":0},{"$f":"+IF(M11=1,1,0)","v":0},{"$f":"+IF(N12=1,1,0)","v":1},{"$f":"+IF(O13=1,1,0)","v":1},{"$f":"+IF(P14=1,1,0)","v":1},{"$f":"SUM(K17:P17)","v":3},null,null,null,0,0,0,0,0,1,null,0,0,0,0,0,-2.0648875576076193]
[]
[null,"Metodo Exacto"]
[]
{"$rows_left_out":205}